Details

    • Type: Bug
    • Status: Open
    • Priority: Major
    • Resolution: Unresolved
    • Affects versions: None
    • Fix versions: None
    • Labels:
    • Platform:
      All
    • Sprint:

      Description

      10.1.0-12630-RELEASE is failed on mvn install.

      haron-osx:PuStatusChange aharon$ mvn install
      [INFO] Scanning for projects...
      [INFO]
      [INFO] ------------------------------------------------------------------------
      [INFO] Building PuStatusChange 1.0-SNAPSHOT
      [INFO] ------------------------------------------------------------------------
      [WARNING] The POM for com.gigaspaces:gs-openspaces:jar:10.1.0-12630-RELEASE is missing, no dependency information available
      [WARNING] The POM for com.gigaspaces:gs-runtime:jar:10.1.0-12630-RELEASE is missing, no dependency information available
      [INFO] ------------------------------------------------------------------------
      [INFO] BUILD FAILURE
      [INFO] ------------------------------------------------------------------------
      [INFO] Total time: 0.271 s
      [INFO] Finished at: 2017-06-07T15:03:54+03:00
      [INFO] Final Memory: 9M/309M
      [INFO] ------------------------------------------------------------------------
      [ERROR] Failed to execute goal on project PuStatusChange: Could not resolve dependencies for project PuStatusChange:PuStatusChange:jar:1.0-SNAPSHOT: The following artifacts could not be resolved: com.gigaspaces:gs-openspaces:jar:10.1.0-12630-RELEASE, com.gigaspaces:gs-runtime:jar:10.1.0-12630-RELEASE: Failure to find com.gigaspaces:gs-openspaces:jar:10.1.0-12630-RELEASE in http://maven-repository.openspaces.org was cached in the local repository, resolution will not be reattempted until the update interval of org.openspaces has elapsed or updates are forced -> [Help 1]
      [ERROR]
      [ERROR] To see the full stack trace of the errors, re-run Maven with the -e switch.
      [ERROR] Re-run Maven using the -X switch to enable full debug logging.
      [ERROR]
      [ERROR] For more information about the errors and possible solutions, please read the following articles:
      [ERROR] [Help 1] http://cwiki.apache.org/confluence/display/MAVEN/DependencyResolutionException

        Attachments

          Activity

            People

            • Votes:
              0 Vote for this issue
              Watchers:
              2 Start watching this issue

              Dates

              • Created:
                Updated: